BDBM401486 6-(4-(2-((thiazol-2- ylamino)methyl)-4- (trifluoromethyl)phenoxy)phenyl) picolinamide::US10005768, Compound 114
SMILES NC(=O)c1cccc(n1)-c1ccc(Oc2ccc(cc2CNc2nccs2)C(F)(F)F)cc1
InChI Key InChIKey=LCMBVXBYYWKUOK-UHFFFAOYSA-N
Data  1 IC50
  Tab Delimited (TSV)   2D SDfile   Computed 3D by Vconf -m prep SDfile
Find this compound or compounds like it in BindingDB:
Activity Spreadsheet -- Enzyme Inhibition Constant Data from BindingDB
Found 1 hit for monomerid = 401486
TargetSodium channel protein type 9 subunit alpha(Homo sapiens (Human))
Purdue Pharma
US Patent
LigandPNGBDBM401486(6-(4-(2-((thiazol-2- ylamino)methyl)-4- (trifluoro...)
Affinity DataIC50:  2.01E+3nM. Assay description: The assay buffer was formulated by removing 120 mL from a 1 L bottle of fresh, sterile dH2O (Mediatech, Herndon, Va.) and adding 100 mL of 10×HBSS th...
Ligand InfoPC cidPC sid
In DepthDetails US Patent