BDBM401504 6-(4-(2-(methylcarbamoyl)-4- (trifluoromethyl)phenoxy)phenyl) picolinamide::US10005768, Compound 163
SMILES CNC(=O)c1cc(ccc1Oc1ccc(cc1)-c1cccc(n1)C(N)=O)C(F)(F)F
InChI Key InChIKey=PBFGSTQEKSNUTN-UHFFFAOYSA-N
Data  1 IC50
  Tab Delimited (TSV)   2D SDfile   Computed 3D by Vconf -m prep SDfile
Find this compound or compounds like it in BindingDB:
Activity Spreadsheet -- Enzyme Inhibition Constant Data from BindingDB
Found 1 hit for monomerid = 401504
TargetSodium channel protein type 9 subunit alpha(Homo sapiens (Human))
Purdue Pharma
US Patent
LigandPNGBDBM401504(6-(4-(2-(methylcarbamoyl)-4- (trifluoromethyl)phen...)
Affinity DataIC50: >2.00E+4nM. Assay description: The assay buffer was formulated by removing 120 mL from a 1 L bottle of fresh, sterile dH2O (Mediatech, Herndon, Va.) and adding 100 mL of 10×HBSS th...
Ligand InfoPC cidPC sid
In DepthDetails US Patent