BDBM401614 US10005769, No. 78
SMILES CCOC(=O)c1csc(NC(=O)c2csc(n2)-c2ccc3OCCc3c2)n1
InChI Key InChIKey=XMFXGLRVVJWUNS-UHFFFAOYSA-N
Data  1 IC50
  Tab Delimited (TSV)   2D SDfile   Computed 3D by Vconf -m prep SDfile
Find this compound or compounds like it in BindingDB:
Activity Spreadsheet -- Enzyme Inhibition Constant Data from BindingDB
Found 1 hit for monomerid = 401614
TargetDual specificity tyrosine-phosphorylation-regulated kinase 1B(Homo sapiens (Human))
4Sc
US Patent
LigandPNGBDBM401614(US10005769, No. 78)
Affinity DataIC50:  410nM. Assay description: The substrate DYRKtide (synthetic peptide RRRFRPASPLRGPPK) was dissolved in freshly prepared Base Reaction Buffer (20 mM Hepes (pH 7.5), 10 mM MgCl2,...
Ligand InfoPC cidPC sid
In DepthDetails US Patent