BDBM401634 US10005788, 10 (2nd peak)
SMILES CCCCNc1ncc2c(nc([C@@H]3CC[C@H](O)CC3)n2n1)-c1ccc(NC(C)=O)cc1
InChI Key InChIKey=LNRIECDTKZTKTE-IZAXUBKRSA-N
Data  1 IC50
  Tab Delimited (TSV)   2D SDfile   Computed 3D by Vconf -m prep SDfile
Find this compound or compounds like it in BindingDB:
Activity Spreadsheet -- Enzyme Inhibition Constant Data from BindingDB
Found 1 hit for monomerid = 401634
TargetTyrosine-protein kinase Mer(Homo sapiens (Human))
Incyte
US Patent
LigandPNGBDBM401634(US10005788, 10 (2nd peak))
Affinity DataIC50:  300nM. Assay description: The kinase assay buffer contained 50 mM HEPES, pH7.5, 10 mM MgCl2, 1 mM EGTA, 0.01% NP-40 and 2 mM DTT. 0.1 ul test compounds dissolved in DMSO were ...
Ligand InfoPC cidPC sid
In DepthDetails US Patent