BDBM401706 US10005792, Compound 68
SMILES O[C@@H](CNC1Cc2ccccc2C1)CNC(=O)c1ccc(nc1)C(=O)N1CCCCC1
InChI Key InChIKey=FGGFIKJKJOQLDV-NRFANRHFSA-N
Data  1 IC50
  Tab Delimited (TSV)   2D SDfile   Computed 3D by Vconf -m prep SDfile
Find this compound or compounds like it in BindingDB:
Activity Spreadsheet -- Enzyme Inhibition Constant Data from BindingDB
Found 1 hit for monomerid = 401706
TargetProtein arginine N-methyltransferase 5(Homo sapiens (Human))
Ctxt
US Patent
LigandPNGBDBM401706(US10005792, Compound 68)
Affinity DataIC50:  6.17E+3nM. Assay description: Compounds of the invention may be tested for in vitro activity in the following assay: A histone H4 derived peptide is used as substrate (amino acid ...
Ligand InfoPC cidPC sid
In DepthDetails US Patent