BDBM401741 US10005792, Compound 103::US10005792, Compound 136
SMILES O[C@@H](CNC1Cc2ccccc2C1)CNC(=O)c1ccc(cc1)C(=O)N1C2CCC1COC2
InChI Key InChIKey=PGJDFOCBYMEXFW-VHYCJAOWSA-N
Data  2 IC50
  Tab Delimited (TSV)   2D SDfile   Computed 3D by Vconf -m prep SDfile
Find this compound or compounds like it in BindingDB:
Activity Spreadsheet -- Enzyme Inhibition Constant Data from BindingDB
Found 2 hits for monomerid = 401741
TargetProtein arginine N-methyltransferase 5(Homo sapiens (Human))
Ctxt
US Patent
LigandPNGBDBM401741(US10005792, Compound 103 | US10005792, Compound 13...)
Affinity DataIC50:  50nM. Assay description: Compounds of the invention may be tested for in vitro activity in the following assay: A histone H4 derived peptide is used as substrate (amino acid ...
Ligand InfoPC cidPC sid
In DepthDetails US Patent
TargetProtein arginine N-methyltransferase 5(Homo sapiens (Human))
Ctxt
US Patent
LigandPNGBDBM401741(US10005792, Compound 103 | US10005792, Compound 13...)
Affinity DataIC50:  120nM. Assay description: Compounds of the invention may be tested for in vitro activity in the following assay: A histone H4 derived peptide is used as substrate (amino acid ...
Ligand InfoPC cidPC sid
In DepthDetails US Patent