BDBM401756 US10005792, Compound 115
SMILES CCOc1nc(ccc1C(=O)NC[C@@H](O)CNC1Cc2ccccc2C1)C(=O)N1C2CCC1COC2
InChI Key InChIKey=IWQVILSYTJZJKO-HRTMPFAESA-N
Data  1 IC50
  Tab Delimited (TSV)   2D SDfile   Computed 3D by Vconf -m prep SDfile
Find this compound or compounds like it in BindingDB:
Activity Spreadsheet -- Enzyme Inhibition Constant Data from BindingDB
Found 1 hit for monomerid = 401756
TargetProtein arginine N-methyltransferase 5(Homo sapiens (Human))
Ctxt
US Patent
LigandPNGBDBM401756(US10005792, Compound 115)
Affinity DataIC50:  305nM. Assay description: Compounds of the invention may be tested for in vitro activity in the following assay: A histone H4 derived peptide is used as substrate (amino acid ...
Ligand InfoPC cidPC sid
In DepthDetails US Patent