BDBM401770 US10005792, Compound 129
SMILES CCOc1cc(CC(=O)N2C3CCC2COC3)ccc1C(=O)NC[C@@H](O)CNC1Cc2ccccc2C1
InChI Key InChIKey=ITSCJCQIHKMFLA-STEQJIOHSA-N
Data  1 IC50
  Tab Delimited (TSV)   2D SDfile   Computed 3D by Vconf -m prep SDfile
Find this compound or compounds like it in BindingDB:
Activity Spreadsheet -- Enzyme Inhibition Constant Data from BindingDB
Found 1 hit for monomerid = 401770
TargetProtein arginine N-methyltransferase 5(Homo sapiens (Human))
Ctxt
US Patent
LigandPNGBDBM401770(US10005792, Compound 129)
Affinity DataIC50:  629nM. Assay description: Compounds of the invention may be tested for in vitro activity in the following assay: A histone H4 derived peptide is used as substrate (amino acid ...
Ligand InfoPC cidPC sid
In DepthDetails US Patent