BDBM40185 (4Z)-4-[(5-bromanylfuran-2-yl)methylidene]-2-methylsulfanyl-1,3-thiazol-5-one::(4Z)-4-[(5-bromo-2-furanyl)methylidene]-2-(methylthio)-5-thiazolone::(4Z)-4-[(5-bromo-2-furyl)methylene]-2-(methylthio)-2-thiazolin-5-one::(4Z)-4-[(5-bromofuran-2-yl)methylidene]-2-methylsulfanyl-1,3-thiazol-5-one::4-[(5-bromo-2-furyl)methylene]-2-(methylthio)-1,3-thiazol-5(4H)-one::MLS000534059::SMR000141496::cid_2234851
SMILES CSC1=N\C(=C/c2ccc(Br)o2)C(=O)S1
InChI Key InChIKey=BCLZKVFTVWRTDY-XQRVVYSFSA-N
Data  3 IC50
  Tab Delimited (TSV)   2D SDfile   Computed 3D by Vconf -m prep SDfile
Find this compound or compounds like it in BindingDB:
Activity Spreadsheet -- Enzyme Inhibition Constant Data from BindingDB
Found 3 hits for monomerid = 40185
TargetEstrogen receptor(Homo sapiens (Human))
Emory University
Curated by PubChem BioAssay
LigandPNGBDBM40185((4Z)-4-[(5-bromanylfuran-2-yl)methylidene]-2-methy...)
Affinity DataIC50:  2.21E+4nM. Assay description: NIH Molecular Libraries Screening Centers Network [MLSCN] Emory Chemical Biology Discovery Center in MLSCN Assay provider: John A. Katzenellenbogen, ...
In DepthDetails PCBioAssay
TargetEstrogen receptor beta(Homo sapiens (Human))
Emory University
Curated by PubChem BioAssay
LigandPNGBDBM40185((4Z)-4-[(5-bromanylfuran-2-yl)methylidene]-2-methy...)
Affinity DataIC50:  8.58E+3nM. Assay description: NIH Molecular Libraries Screening Centers Network [MLSCN] Emory Chemical Biology Discovery Center in MLSCN Assay provider: John A. Katzenellenbogen, ...
In DepthDetails PCBioAssay
TargetEstrogen receptor beta(Homo sapiens (Human))
Emory University
Curated by PubChem BioAssay
LigandPNGBDBM40185((4Z)-4-[(5-bromanylfuran-2-yl)methylidene]-2-methy...)
Affinity DataIC50:  23nM. Assay description: NIH Molecular Libraries Screening Centers Network [MLSCN] Emory Chemical Biology Discovery Center in MLSCN Assay provider: John A. Katzenellenbogen, ...
In DepthDetails PCBioAssay