BDBM402056 N-(2-((4,6-dimethylpyrimidin-2- yl)(methyl)amino)ethyl)-N-ethyl-2- (1H-pyrazol-1-yl)benzamide::US10011595, B-14
SMILES CCN(CCN(C)c1nc(C)cc(C)n1)C(=O)c1ccccc1-n1cccn1
InChI Key InChIKey=YQAKEEXTPKVOQK-UHFFFAOYSA-N
Data  2 IC50
  Tab Delimited (TSV)   2D SDfile   Computed 3D by Vconf -m prep SDfile
Find this compound or compounds like it in BindingDB:
Activity Spreadsheet -- Enzyme Inhibition Constant Data from BindingDB
Found 2 hits for monomerid = 402056
TargetOrexin/Hypocretin receptor type 1(Homo sapiens (Human))
Merck Sharp & Dohme
US Patent
LigandPNGBDBM402056(N-(2-((4,6-dimethylpyrimidin-2- yl)(methyl)amino)e...)
Affinity DataIC50:  2.60E+3nM. Assay description: In a typical experiment the OX1 and OX2 receptor antagonistic activity of the compounds of the present invention was determined in accordance with th...
Ligand InfoPC cidPC sid
In DepthDetails US Patent
TargetOrexin receptor type 2(Homo sapiens (Human))
Merck Sharp & Dohme
US Patent
LigandPNGBDBM402056(N-(2-((4,6-dimethylpyrimidin-2- yl)(methyl)amino)e...)
Affinity DataIC50:  13.9nM. Assay description: In a typical experiment the OX1 and OX2 receptor antagonistic activity of the compounds of the present invention was determined in accordance with th...
Ligand InfoPC cidPC sid
In DepthDetails US Patent