BDBM40219 3-(4-methylphenyl)-4-[[(Z)-3-(2-nitrophenyl)prop-2-enylidene]amino]-1H-1,2,4-triazole-5-thione::4-[[(E)-3-(2-nitrophenyl)prop-2-enylidene]amino]-3-(p-tolyl)-1H-1,2,4-triazole-5-thione::4-[[(Z)-3-(2-nitrophenyl)prop-2-enylidene]amino]-3-(p-tolyl)-1H-1,2,4-triazole-5-thione::5-(4-methylphenyl)-4-{[3-(2-nitrophenyl)-2-propen-1-ylidene]amino}-4H-1,2,4-triazole-3-thiol::MLS000534016::SMR000141452::cid_1960170
SMILES Cc1ccc(cc1)-c1n[nH]c(=S)n1[N-]C=C[CH+]c1ccccc1[N+]([O-])=O
InChI Key InChIKey=DHOLMHFYXLBMEV-UHFFFAOYSA-N
Data  2 IC50  5 EC50
  Tab Delimited (TSV)   2D SDfile   Computed 3D by Vconf -m prep SDfile
Find this compound or compounds like it in BindingDB:
Activity Spreadsheet -- Enzyme Inhibition Constant Data from BindingDB
Found 7 hits for monomerid = 40219
TargetEstrogen receptor(Homo sapiens (Human))
Emory University
Curated by PubChem BioAssay
LigandPNGBDBM40219(3-(4-methylphenyl)-4-[[(Z)-3-(2-nitrophenyl)prop-2...)
Affinity DataIC50:  7.32E+3nM. Assay description: NIH Molecular Libraries Screening Centers Network [MLSCN] Emory Chemical Biology Discovery Center in MLSCN Assay provider: John A. Katzenellenbogen, ...
In DepthDetails PCBioAssay
TargetEstrogen receptor(Homo sapiens (Human))
Emory University
Curated by PubChem BioAssay
LigandPNGBDBM40219(3-(4-methylphenyl)-4-[[(Z)-3-(2-nitrophenyl)prop-2...)
Affinity DataEC50:  6.52E+3nM. Assay description: NIH Molecular Libraries Screening Centers Network [MLSCN] Emory Chemical Biology Discovery Center in MLSCN Assay provider: John A. Katzenellenbogen, ...
In DepthDetails PCBioAssay
TargetNuclear receptor subfamily 4 group A member 1(Homo sapiens (Human))
Burnham Center For Chemical Genomics
Curated by PubChem BioAssay
LigandPNGBDBM40219(3-(4-methylphenyl)-4-[[(Z)-3-(2-nitrophenyl)prop-2...)
Affinity DataIC50: >1.00E+5nM. Assay description: Sanford-Burnham Center for Chemical Genomics (SBCCG) Sanford-Burnham Medical Research Institute (San Diego, CA) NIH Molecular Libraries Screening Cen...
In DepthDetails PCBioAssay
TargetSolute carrier family 12 member 5(Homo sapiens (Human))
Vanderbilt Screening Center For Gpcrs, Ion Channels And Transporters
Curated by PubChem BioAssay
LigandPNGBDBM40219(3-(4-methylphenyl)-4-[[(Z)-3-(2-nitrophenyl)prop-2...)
Affinity DataEC50:  1.28E+3nM. Assay description: Vanderbilt Screening Center for GPCRs, Ion Channels and Transporters Assay Provider: Eric Delpire Assay Provider Affliation: Vanderbilt University Gr...
In DepthDetails PCBioAssay
TargetSolute carrier family 12 member 5(Homo sapiens (Human))
Vanderbilt Screening Center For Gpcrs, Ion Channels And Transporters
Curated by PubChem BioAssay
LigandPNGBDBM40219(3-(4-methylphenyl)-4-[[(Z)-3-(2-nitrophenyl)prop-2...)
Affinity DataEC50:  807nM. Assay description: Vanderbilt Screening Center for GPCRs, Ion Channels and Transporters Assay Provider: Eric Delpire Assay Provider Affliation: Vanderbilt University Gr...
In DepthDetails PCBioAssay
TargetSolute carrier family 12 member 5(Homo sapiens (Human))
Vanderbilt Screening Center For Gpcrs, Ion Channels And Transporters
Curated by PubChem BioAssay
LigandPNGBDBM40219(3-(4-methylphenyl)-4-[[(Z)-3-(2-nitrophenyl)prop-2...)
Affinity DataEC50:  1.62E+3nM. Assay description: Vanderbilt Screening Center for GPCRs, Ion Channels and Transporters Assay Provider: Eric Delpire Assay Provider Affliation: Vanderbilt University Gr...
In DepthDetails PCBioAssay
TargetSolute carrier family 12 member 5(Homo sapiens (Human))
Vanderbilt Screening Center For Gpcrs, Ion Channels And Transporters
Curated by PubChem BioAssay
LigandPNGBDBM40219(3-(4-methylphenyl)-4-[[(Z)-3-(2-nitrophenyl)prop-2...)
Affinity DataEC50:  1.80E+3nM. Assay description: Vanderbilt Screening Center for GPCRs, Ion Channels and Transporters Assay Provider: Eric Delpire Assay Provider Affliation: Vanderbilt University Gr...
In DepthDetails PCBioAssay