BDBM402195 (9aRS)-7-[2,6-difluoro-4-(2- phenylethynyl)phenyl]-9a-methyl- 2-pyrimidin-5-yl-4,9-dihydro- 3H-pyrazino[1,2- c]pyrimidine-1,6,8-trione::US10011607, 28
SMILES CC12CC(=O)N(C(=O)N1CCN(C2=O)c1cncnc1)c1c(F)cc(cc1F)C#Cc1ccccc1
InChI Key InChIKey=SXSFCMDTJHQNIM-UHFFFAOYSA-N
Data  1 EC50
  Tab Delimited (TSV)   2D SDfile   Computed 3D by Vconf -m prep SDfile
Find this compound or compounds like it in BindingDB:
Activity Spreadsheet -- Enzyme Inhibition Constant Data from BindingDB
Found 1 hit for monomerid = 402195
TargetMetabotropic glutamate receptor 4(Homo sapiens (Human))
Hoffmann-La Roche
US Patent
LigandPNGBDBM402195((9aRS)-7-[2,6-difluoro-4-(2- phenylethynyl)phenyl]...)
Affinity DataEC50:  145nM. Assay description: A monoclonal HEK-293 cell line stably transfected with a cDNA encoding for the human mGlu4 receptor was generated; for the work with mGlu4 Positive A...
Ligand InfoPC cidPC sid
In DepthDetails US Patent