BDBM402248 (9aRS)-7-[2-chloro-6-fluoro-4-(2- phenylethynyl)phenyl]-9a- methyl-2-(2-pyridyl)-4,9- dihydro-3H-pyrazino[1,2- c]pyrimidine-1,6,8-trione::US10011607, 76
SMILES CC12CC(=O)N(C(=O)N1CCN(C2=O)c1ccccn1)c1c(F)cc(cc1Cl)C#Cc1ccccc1
InChI Key InChIKey=AOVPEMHSGRLZAD-UHFFFAOYSA-N
Data  1 EC50
  Tab Delimited (TSV)   2D SDfile   Computed 3D by Vconf -m prep SDfile
Find this compound or compounds like it in BindingDB:
Activity Spreadsheet -- Enzyme Inhibition Constant Data from BindingDB
Found 1 hit for monomerid = 402248
TargetMetabotropic glutamate receptor 4(Homo sapiens (Human))
Hoffmann-La Roche
US Patent
LigandPNGBDBM402248((9aRS)-7-[2-chloro-6-fluoro-4-(2- phenylethynyl)ph...)
Affinity DataEC50:  128nM. Assay description: A monoclonal HEK-293 cell line stably transfected with a cDNA encoding for the human mGlu4 receptor was generated; for the work with mGlu4 Positive A...
Ligand InfoPC cidPC sid
In DepthDetails US Patent