BDBM402346 US10329291, Example 2
SMILES CN1C(=N)N[C@]2(CCC[C@H]2S1(=O)=O)c1cc(NC(=O)c2cnc(OCCF)cn2)ccc1F
InChI Key InChIKey=TUDUEFUAQZKIDM-OXQOHEQNSA-N
Data  2 KI
  Tab Delimited (TSV)   2D SDfile   Computed 3D by Vconf -m prep SDfile
Find this compound or compounds like it in BindingDB:
Activity Spreadsheet -- Enzyme Inhibition Constant Data from BindingDB
Found 2 hits for monomerid = 402346
TargetBeta-secretase 1(Homo sapiens (Human))
TBA
US Patent
LigandPNGBDBM402346(US10329291, Example 2)
Affinity DataKi:  18nM. Assay description: The compounds of the invention were assessed for their ability to inhibit BACE-1 using the following assay. The resulting values are reported in the ...
Ligand InfoPC cidPC sid
In DepthDetails US Patent
TargetBeta-secretase 2(Homo sapiens (Human))
TBA
US Patent
LigandPNGBDBM402346(US10329291, Example 2)
Affinity DataKi:  28nM. Assay description: The compounds of the invention were assessed for their ability to inhibit BACE-1 using the following assay. The resulting values are reported in the ...
Ligand InfoPC cidPC sid
In DepthDetails US Patent