BDBM402391 US10329282, Compound TDI01398::US11390609, Compound TDI01398
SMILES O=C(N1CC(C1)C#N)c1cc2ccc(cc2[nH]1)-c1nccc(Nc2ccc(cc2)-c2cn[nH]c2)n1
InChI Key InChIKey=OAGFXWFRJCGKCM-UHFFFAOYSA-N
Data  3 IC50
  Tab Delimited (TSV)   2D SDfile   Computed 3D by Vconf -m prep SDfile
Find this compound or compounds like it in BindingDB:
Activity Spreadsheet -- Enzyme Inhibition Constant Data from BindingDB
Found 3 hits for monomerid = 402391
TargetRho-associated protein kinase 2 [1-119](Homo sapiens (Human))
Beijing Tide Pharmaceutical
US Patent
LigandPNGBDBM402391(US10329282, Compound TDI01398 | US11390609, Compou...)
Affinity DataIC50:  16nM. Assay description: The kinase IC50 was determined by a commercialized CISBIO kinase detection kit, HTRF KinEASE-STK S2 kit (62ST2PEC). ROCK2 (01-119) employed in the re...
Ligand InfoPC cidPC sid
In DepthDetails US Patent
TargetRho-associated protein kinase 2(Homo sapiens (Human))
Beijing Tide Pharmaceutical
US Patent
LigandPNGBDBM402391(US10329282, Compound TDI01398 | US11390609, Compou...)
Affinity DataIC50:  16nM. Assay description: The kinase IC50 was determined by a commercialized CISBIO kinase detection kit, HTRF KinEASE-STK S2 kit (62ST2PEC). ROCK2 (01-119) employed in the re...
Ligand InfoPC cidPC sid
In DepthDetails US Patent
TargetRho-associated protein kinase 1(Homo sapiens (Human))
Beijing Tide Pharmaceutical
US Patent
LigandPNGBDBM402391(US10329282, Compound TDI01398 | US11390609, Compou...)
Affinity DataIC50: >1.00E+4nM. Assay description: The kinase IC50 was determined by a commercialized CISBIO kinase detection kit, HTRF KinEASE-STK S2 kit (62ST2PEC). ROCK2 (01-119) employed in the re...
Ligand InfoPC cidPC sid
In DepthDetails US Patent