BDBM402697 2-(5,8-diazaspiro[2.6]non- 5-yl)-N-[3- (difluoromethyl)-1- methyl-1H-pyrazol-4- yl]pyrrolo[2,1- f][1,2,4]triazine-7- carboxamide trifluoroacetate::US10329295, Example 20
SMILES Cn1cc(NC(=O)c2ccc3cnc(nn23)N2CCNCC3(CC3)C2)c(n1)C(F)F
InChI Key InChIKey=IPMSLRODRDJWCD-UHFFFAOYSA-N
Data  1 IC50
  Tab Delimited (TSV)   2D SDfile   Computed 3D by Vconf -m prep SDfile
Find this compound or compounds like it in BindingDB:
Activity Spreadsheet -- Enzyme Inhibition Constant Data from BindingDB
Found 1 hit for monomerid = 402697
TargetInterleukin-1 receptor-associated kinase 4(Homo sapiens (Human))
Merck Sharp & Dohme
US Patent
LigandPNGBDBM402697(2-(5,8-diazaspiro[2.6]non- 5-yl)-N-[3- (difluorome...)
Affinity DataIC50:  2nM. Assay description: The kinase activity of IRAK4 is determined by its ability to catalyze the phosphorylation of a fluorescent polypeptide substrate. The extent of phosp...
Ligand InfoPC cidPC sid
In DepthDetails US Patent