BDBM402762 2-[(3S)- or (3R)-azepan-3- ylamino]-N-[1-methyl-3- (trifluoromethyl)-1H- pyrazol-4-yl]pyrrolo[2,1- f][1,2,4]triazine-7- carboxamide trifluoroacetate::US10329295, Example 69
SMILES Cn1cc(NC(=O)c2ccc3cnc(N[C@H]4CCCCNC4)nn23)c(n1)C(F)(F)F
InChI Key InChIKey=SIYYEKGXAMXTDJ-NSHDSACASA-N
Data  1 IC50
  Tab Delimited (TSV)   2D SDfile   Computed 3D by Vconf -m prep SDfile
Find this compound or compounds like it in BindingDB:
Activity Spreadsheet -- Enzyme Inhibition Constant Data from BindingDB
Found 1 hit for monomerid = 402762
TargetInterleukin-1 receptor-associated kinase 4(Homo sapiens (Human))
Merck Sharp & Dohme
US Patent
LigandPNGBDBM402762(2-[(3S)- or (3R)-azepan-3- ylamino]-N-[1-methyl-3-...)
Affinity DataIC50:  5nM. Assay description: The kinase activity of IRAK4 is determined by its ability to catalyze the phosphorylation of a fluorescent polypeptide substrate. The extent of phosp...
Ligand InfoPC cidPC sid
In DepthDetails US Patent