BDBM402796 N-(4-chlorothiophen-3-yl)- 2-(1,4-diazepan-1- yl)pyrrolo[2,1- f][1,2,4]triazine-7- carboxamide trifluoroacetate::US10329295, Example 105
SMILES Clc1cscc1NC(=O)c1ccc2cnc(nn12)N1CCCNCC1
InChI Key InChIKey=SSXTYEOGBRIHMZ-UHFFFAOYSA-N
Data  1 IC50
  Tab Delimited (TSV)   2D SDfile   Computed 3D by Vconf -m prep SDfile
Find this compound or compounds like it in BindingDB:
Activity Spreadsheet -- Enzyme Inhibition Constant Data from BindingDB
Found 1 hit for monomerid = 402796
TargetInterleukin-1 receptor-associated kinase 4(Homo sapiens (Human))
Merck Sharp & Dohme
US Patent
LigandPNGBDBM402796(N-(4-chlorothiophen-3-yl)- 2-(1,4-diazepan-1- yl)p...)
Affinity DataIC50:  4.82E+3nM. Assay description: The kinase activity of IRAK4 is determined by its ability to catalyze the phosphorylation of a fluorescent polypeptide substrate. The extent of phosp...
Ligand InfoPC cidPC sid
In DepthDetails US Patent