BDBM402800 2-{[(1R,2S)-2- aminocyclohexyl]amino}- N-(4-chlorothiophen-3- yl)pyrrolo[2,1- f][1,2,4]triazine-7- carboxamide trifluoroacetate::US10329295, Example 109
SMILES N[C@H]1CCCC[C@H]1Nc1ncc2ccc(C(=O)Nc3cscc3Cl)n2n1
InChI Key InChIKey=LHRCZSITJCYPGC-QWHCGFSZSA-N
Data  1 IC50
  Tab Delimited (TSV)   2D SDfile   Computed 3D by Vconf -m prep SDfile
Find this compound or compounds like it in BindingDB:
Activity Spreadsheet -- Enzyme Inhibition Constant Data from BindingDB
Found 1 hit for monomerid = 402800
TargetInterleukin-1 receptor-associated kinase 4(Homo sapiens (Human))
Merck Sharp & Dohme
US Patent
LigandPNGBDBM402800(2-{[(1R,2S)-2- aminocyclohexyl]amino}- N-(4-chloro...)
Affinity DataIC50:  2nM. Assay description: The kinase activity of IRAK4 is determined by its ability to catalyze the phosphorylation of a fluorescent polypeptide substrate. The extent of phosp...
Ligand InfoPC cidPC sid
In DepthDetails US Patent