BDBM40297 1-(3,4-dimethylphenyl)-6-(methylthio)-2H-pyrazolo[3,4-d]pyrimidin-4-one::1-(3,4-dimethylphenyl)-6-methylsulfanyl-2H-pyrazolo[3,4-d]pyrimidin-4-one::MLS000101135::SMR000016362::cid_866975
SMILES CSc1nc2n(ncc2c(=O)[nH]1)-c1ccc(C)c(C)c1
InChI Key InChIKey=NJTNBDBAOMVXIA-UHFFFAOYSA-N
Data  4 IC50
  Tab Delimited (TSV)   2D SDfile   Computed 3D by Vconf -m prep SDfile
Find this compound or compounds like it in BindingDB:
Activity Spreadsheet -- Enzyme Inhibition Constant Data from BindingDB
Found 4 hits for monomerid = 40297
TargetUbiquitin carboxyl-terminal hydrolase BAP1(Homo sapiens (Human))
Emory University
Curated by PubChem BioAssay
LigandPNGBDBM40297(1-(3,4-dimethylphenyl)-6-(methylthio)-2H-pyrazolo[...)
Affinity DataIC50: >5.00E+4nM. Assay description: NIH Molecular Libraries Screening Centers Network [MLSCN] Emory Chemical Biology Discovery Center in MLSCN Assay provider: Keith D. Wilkinson, Emory ...
In DepthDetails PCBioAssay
TargetDNA damage-inducible transcript 3 protein(Mus musculus)
Emory University
Curated by PubChem BioAssay
LigandPNGBDBM40297(1-(3,4-dimethylphenyl)-6-(methylthio)-2H-pyrazolo[...)
Affinity DataIC50:  870nM. Assay description: NIH Molecular Libraries Screening Centers Network [MLSCN] Emory Chemical Biology Discovery Center in MLSCN Assay provider: Dr. Randal Kaufman, Univer...
In DepthDetails PCBioAssay
TargetX-box-binding protein 1(Homo sapiens (Human))
Emory University
Curated by PubChem BioAssay
LigandPNGBDBM40297(1-(3,4-dimethylphenyl)-6-(methylthio)-2H-pyrazolo[...)
Affinity DataIC50:  5.52E+3nM. Assay description: NIH Molecular Libraries Screening Centers Network [MLSCN] Emory Chemical Biology Discovery Center in MLSCN Assay provider: Dr. Randal Kaufman, Univer...
In DepthDetails PCBioAssay
TargetDNA damage-inducible transcript 3 protein(Mus musculus)
Emory University
Curated by PubChem BioAssay
LigandPNGBDBM40297(1-(3,4-dimethylphenyl)-6-(methylthio)-2H-pyrazolo[...)
Affinity DataIC50:  870nM. Assay description: NIH Molecular Libraries Screening Centers Network [MLSCN] Emory Chemical Biology Discovery Center in MLSCN Assay provider: Dr. Randal Kaufman, Univer...
In DepthDetails PCBioAssay