BDBM40303 2-anilino-4-(3-furanyl)-6-oxo-N-phenyl-1-cyclohexenecarboxamide::2-anilino-4-(3-furyl)-6-keto-N-phenyl-cyclohexene-1-carboxamide::2-anilino-4-(furan-3-yl)-6-oxo-N-phenylcyclohexene-1-carboxamide::4-(furan-3-yl)-6-oxidanylidene-N-phenyl-2-phenylazanyl-cyclohexene-1-carboxamide::MLS000112551::SMR000108464::cid_2916627
SMILES O=C(Nc1ccccc1)C1=C(CC(CC1=O)c1ccoc1)Nc1ccccc1
InChI Key InChIKey=PRQKQWUGYCKFHB-UHFFFAOYSA-N
Data  1 IC50  1 EC50
  Tab Delimited (TSV)   2D SDfile   Computed 3D by Vconf -m prep SDfile
Find this compound or compounds like it in BindingDB:
Activity Spreadsheet -- Enzyme Inhibition Constant Data from BindingDB
Found 2 hits for monomerid = 40303
TargetHeat shock factor protein 1(Mus musculus)
Broad Institute
Curated by PubChem BioAssay
LigandPNGBDBM40303(2-anilino-4-(3-furanyl)-6-oxo-N-phenyl-1-cyclohexe...)
Affinity DataEC50: >2.60E+5nM. Assay description: Keywords: Heat Shock Factor-1 (HSF-1), Stress Response, MG132, NIH3T3, Luminescence Assay Overview: Confirmation testing of small molecules identifie...
In DepthDetails PCBioAssay
TargetUbiquitin carboxyl-terminal hydrolase BAP1(Homo sapiens (Human))
Emory University
Curated by PubChem BioAssay
LigandPNGBDBM40303(2-anilino-4-(3-furanyl)-6-oxo-N-phenyl-1-cyclohexe...)
Affinity DataIC50: >5.00E+4nM. Assay description: NIH Molecular Libraries Screening Centers Network [MLSCN] Emory Chemical Biology Discovery Center in MLSCN Assay provider: Keith D. Wilkinson, Emory ...
In DepthDetails PCBioAssay