BDBM403226 US10329303, Example 25
SMILES CC(C)Cc1nn(C)c(=O)c2c(-c3ncc(CO)s3)n(Cc3cccc4ccccc34)cc12
InChI Key InChIKey=APVMBADTVFKFHC-UHFFFAOYSA-N
Data  1 EC50
  Tab Delimited (TSV)   2D SDfile   Computed 3D by Vconf -m prep SDfile
Find this compound or compounds like it in BindingDB:
Activity Spreadsheet -- Enzyme Inhibition Constant Data from BindingDB
Found 1 hit for monomerid = 403226
TargetMalignant T-cell-amplified sequence 1(Homo sapiens (human))
The Scripps Research Institute
US Patent
LigandPNGBDBM403226(US10329303, Example 25)
Affinity DataEC50:  300nM. Assay description: pecific Examples 1-52 of compounds of the invention, with estimated EC50 values determined using an MTT assay for 4-day viability of Raji (Burkitt...
Ligand InfoPC cidPC sid
In DepthDetails US Patent