BDBM403281 US10329307, Example 28
SMILES COc1nn2cc(nc2s1)-c1cc2c(OC[C@@H]3CCCN(C3)c3ccc(cc3)C#N)cc(OC)cc2o1
InChI Key InChIKey=LULKTQQBFWDAJC-GOSISDBHSA-N
Data  1 IC50
  Tab Delimited (TSV)   2D SDfile   Computed 3D by Vconf -m prep SDfile
Find this compound or compounds like it in BindingDB:
Activity Spreadsheet -- Enzyme Inhibition Constant Data from BindingDB
Found 1 hit for monomerid = 403281
TargetPRKC apoptosis WT1 regulator protein(Homo sapiens (Human))
Universite De Montreal
US Patent
LigandPNGBDBM403281(US10329307, Example 28)
Affinity DataIC50:  1.80E+3nM. Assay description: FLIPR-based calcium mobilization assay in HEK293 cells was used to measure PAR4 antagonism, agonism, and selectivity against PAR1. The activity of th...
Ligand InfoPC cidPC sid
In DepthDetails US Patent