BDBM403313 US10329307, Example 60
SMILES COc1nn2cc(nc2s1)-c1cc2c(OCC3CCCN(C3)c3nncs3)cc(OC)cc2o1
InChI Key InChIKey=MWKHSHUSQISWRL-UHFFFAOYSA-N
Data  1 IC50
  Tab Delimited (TSV)   2D SDfile   Computed 3D by Vconf -m prep SDfile
Find this compound or compounds like it in BindingDB:
Activity Spreadsheet -- Enzyme Inhibition Constant Data from BindingDB
Found 1 hit for monomerid = 403313
TargetPRKC apoptosis WT1 regulator protein(Homo sapiens (Human))
Universite De Montreal
US Patent
LigandPNGBDBM403313(US10329307, Example 60)
Affinity DataIC50:  2.70E+3nM. Assay description: FLIPR-based calcium mobilization assay in HEK293 cells was used to measure PAR4 antagonism, agonism, and selectivity against PAR1. The activity of th...
Ligand InfoPC cidPC sid
In DepthDetails US Patent