BDBM403409 US10335392, Example 16
SMILES CC(C)(O)Cn1cc(cn1)-c1cc2n3[C@H]([C@H]4C[C@H]4c3nc2cc1F)c1ccccc1OC(F)F
InChI Key InChIKey=ZWWMMUMETQYJQW-JKSBSHDWSA-N
Data  1 IC50
  Tab Delimited (TSV)   2D SDfile   Computed 3D by Vconf -m prep SDfile
Find this compound or compounds like it in BindingDB:
Activity Spreadsheet -- Enzyme Inhibition Constant Data from BindingDB
Found 1 hit for monomerid = 403409
TargetTumor necrosis factor(Homo sapiens (Human))
Bristol-Myers Squibb
US Patent
LigandPNGBDBM403409(US10335392, Example 16)
Affinity DataIC50:  5.50E+3nM. Assay description: Test compounds serially diluted in DMSO were plated in an assay plate (LABCYTE, Cat. # LP-0200) at final concentrations ranging from 0.004 μM to...
Ligand InfoPC cidPC sid
In DepthDetails US Patent