BDBM403505 US10335401, No. I-11
SMILES COc1ccc(nc1)C1=C(CNC(C)=O)C(=O)N[C@@](C1)(c1ccc(OCCCC(F)(F)F)cc1)C(F)(F)F
InChI Key InChIKey=PVAMMTGMNWGCSB-QHCPKHFHSA-N
Data  1 IC50
  Tab Delimited (TSV)   2D SDfile   Computed 3D by Vconf -m prep SDfile
Find this compound or compounds like it in BindingDB:
Activity Spreadsheet -- Enzyme Inhibition Constant Data from BindingDB
Found 1 hit for monomerid = 403505
LigandPNGBDBM403505(US10335401, No. I-11)
Affinity DataIC50:  110nM. Assay description: A full-length human MGAT2 gene to which a Flag-tag had been added at the N-terminal was inserted into pFastBac (from Invitrogen). A recombinant bacul...
Ligand InfoPC cidPC sid
In DepthDetails US Patent