BDBM403513 US10335401, No. I-19
SMILES COc1ccc(nc1)C1=C(CNS(=O)(=O)CC(F)(F)F)C(=O)N[C@@](C1)(c1ccc(OCCCC(F)(F)F)cc1)C(F)(F)F
InChI Key InChIKey=IXDLDCHAHIGVMM-QFIPXVFZSA-N
Data  1 IC50
  Tab Delimited (TSV)   2D SDfile   Computed 3D by Vconf -m prep SDfile
Find this compound or compounds like it in BindingDB:
Activity Spreadsheet -- Enzyme Inhibition Constant Data from BindingDB
Found 1 hit for monomerid = 403513
LigandPNGBDBM403513(US10335401, No. I-19)
Affinity DataIC50:  240nM. Assay description: A full-length human MGAT2 gene to which a Flag-tag had been added at the N-terminal was inserted into pFastBac (from Invitrogen). A recombinant bacul...
Ligand InfoPC cidPC sid
In DepthDetails US Patent