BDBM403632 (1aS,5S,8S,9S,10R,22aS)-5-tert-butyl-N-[(1R,2R)-2-(difluoromethyl)-1-{[(1-methylcyclopropyl)sulfonyl]carbamoyl}cyclopropyl]-1a-ethyl-14-methoxy-9-methyl-3,6-dioxo-1,1a,3,4,5,6,9,10,18,19,20,21,22,22a-tetradecahydro-8H-7,10-methanocyclopropa[18,19][1,10,3,6]dioxadiazacyclononadecino[11,12-b]quinoxaline-8-carboxamide::US10335409, Example 42
SMILES CC[C@@]1(C[C@@H]1CCCC=C)OC(=O)N[C@H](C(=O)N1C[C@H](Oc2nc3cc(OC)ccc3nc2Cl)[C@@H](C)[C@H]1C(=O)OC(C)(C)C)C(C)(C)C
InChI Key InChIKey=UKMUGYRNDYIYQC-FGKZWBPQSA-N
Data  2 KI
  Tab Delimited (TSV)   2D SDfile   Computed 3D by Vconf -m prep SDfile
Find this compound or compounds like it in BindingDB:
Activity Spreadsheet -- Enzyme Inhibition Constant Data from BindingDB
Found 2 hits for monomerid = 403632
TargetGenome polyprotein(Hepatitis C Virus (Virus))
Gilead Pharmasset
US Patent
LigandPNGBDBM403632((1aS,5S,8S,9S,10R,22aS)-5-tert-butyl-N-[(1R,2R)-2-...)
Affinity DataKi:  0.100nM. Assay description: Purified NS3 protease domain (amino acids 1-181) of the genotype 1b and 3a virus were generated as above. The internally quenched fluorogenic depsipe...
Ligand InfoPC cidPC sid
In DepthDetails US Patent
TargetGenome polyprotein(Hepatitis C virus genotype 3a (isolate k3a) (HCV))
Gilead Pharmasset
US Patent
LigandPNGBDBM403632((1aS,5S,8S,9S,10R,22aS)-5-tert-butyl-N-[(1R,2R)-2-...)
Affinity DataKi:  0.75nM. Assay description: Purified NS3 protease domain (amino acids 1-181) of the genotype 1b and 3a virus were generated as above. The internally quenched fluorogenic depsipe...
Ligand InfoPC cidPC sid
In DepthDetails US Patent