BDBM403689 (1R,2R)-2-(4-((+/−)-3-Phenoxycyclohexyl)phenethyl)cyclopropanecarboxylic acid (cis-1,3-cyclohexyl isomer; Absolute Stereochemistry of the Cyclohexyl Moiety is Arbitrarily Drawn)::US10336684, Example 10
SMILES OC(=O)[C@@H]1C[C@H]1CCc1ccc(cc1)[C@@H]1CCC[C@@H](C1)Oc1ccccc1
InChI Key InChIKey=PBTFSZHZBADCEX-YXPKMTABSA-N
Data  1 EC50
  Tab Delimited (TSV)   2D SDfile   Computed 3D by Vconf -m prep SDfile
Find this compound or compounds like it in BindingDB:
Activity Spreadsheet -- Enzyme Inhibition Constant Data from BindingDB
Found 1 hit for monomerid = 403689
TargetFree fatty acid receptor 4(Homo sapiens (Human))
Bristol=Myers Squibb
US Patent
LigandPNGBDBM403689((1R,2R)-2-(4-((+/−)-3-Phenoxycyclohexyl)phen...)
Affinity DataEC50:  530nM. Assay description: The human and mouse GPR120-mediated intracellular phosphorylated ERK assays were also established using CHO-K1 cells stably transfected with the shor...
Ligand InfoPC cidPC sid
In DepthDetails US Patent