BDBM403704 (S)-5-(2,6-Difluoro-4-(3-phenoxypiperidin-1-yl)phenyl)pentanoic acid::US10336684, Example 25
SMILES OC(=O)CCCCc1c(F)cc(cc1F)N1CCC[C@@H](C1)Oc1ccccc1
InChI Key InChIKey=UBKUTQMKHZLUKE-SFHVURJKSA-N
Data  1 EC50
  Tab Delimited (TSV)   2D SDfile   Computed 3D by Vconf -m prep SDfile
Find this compound or compounds like it in BindingDB:
Activity Spreadsheet -- Enzyme Inhibition Constant Data from BindingDB
Found 1 hit for monomerid = 403704
TargetFree fatty acid receptor 4(Homo sapiens (Human))
Bristol=Myers Squibb
US Patent
LigandPNGBDBM403704((S)-5-(2,6-Difluoro-4-(3-phenoxypiperidin-1-yl)phe...)
Affinity DataEC50:  540nM. Assay description: The human and mouse GPR120-mediated intracellular phosphorylated ERK assays were also established using CHO-K1 cells stably transfected with the shor...
Ligand InfoPC cidPC sid
In DepthDetails US Patent