BDBM40372 MLS000096234::N-(2-chloro-4-fluoro-benzyl)-1-esyl-isonipecotamide::N-(2-chloro-4-fluorobenzyl)-1-(ethylsulfonyl)piperidine-4-carboxamide::N-[(2-chloranyl-4-fluoranyl-phenyl)methyl]-1-ethylsulfonyl-piperidine-4-carboxamide::N-[(2-chloro-4-fluorophenyl)methyl]-1-ethylsulfonyl-4-piperidinecarboxamide::N-[(2-chloro-4-fluorophenyl)methyl]-1-ethylsulfonylpiperidine-4-carboxamide::SMR000032182::cid_3244069
SMILES CCS(=O)(=O)N1CCC(CC1)C(=O)NCc1ccc(F)cc1Cl
InChI Key InChIKey=BVCZGIWUAVZBNX-UHFFFAOYSA-N
Data  1 IC50
  Tab Delimited (TSV)   2D SDfile   Computed 3D by Vconf -m prep SDfile
Find this compound or compounds like it in BindingDB:
Activity Spreadsheet -- Enzyme Inhibition Constant Data from BindingDB
Found 1 hit for monomerid = 40372
TargetCoagulation factor XII(Homo sapiens (Human))
Pcmd
Curated by PubChem BioAssay
LigandPNGBDBM40372(MLS000096234 | N-(2-chloro-4-fluoro-benzyl)-1-esyl...)
Affinity DataIC50: >5.00E+4nM. Assay description: Molecular Library Screening Center Network (MLSCN) Penn Center for Molecular Discovery (PCMD) Assay Provider: Scott L. Diamond, University of Pennsy...
In DepthDetails PCBioAssay