BDBM403743 US10336710, Example I3
SMILES CC(C)(Sc1nc2cc(Br)ccc2n1-c1ccc(C#N)c2ccccc12)C(O)=O
InChI Key InChIKey=MZPGKYJJVDAOER-UHFFFAOYSA-N
Data  1 IC50
  Tab Delimited (TSV)   2D SDfile   Computed 3D by Vconf -m prep SDfile
Find this compound or compounds like it in BindingDB:
Activity Spreadsheet -- Enzyme Inhibition Constant Data from BindingDB
Found 1 hit for monomerid = 403743
TargetSolute carrier family 22 member 12(Homo sapiens (Human))
TBA
US Patent
LigandPNGBDBM403743(US10336710, Example I3)
Affinity DataIC50:  8.00E+3nM. Assay description: A plasmid (EX-T4563-M03, GeneCopoeia) containing the full-length human URAT1 gene (SLC22A12) was transfected into Flp-InT-REx-293 cells to construct ...
Ligand InfoPC cidPC sid
In DepthDetails US Patent