BDBM403765 US10336721, Example 23::US10968198, Example 23
SMILES Fc1ccc(cc1)-n1cc(nn1)-c1ccc2cc(OCCOCCN3CCOCC3)ccc2n1
InChI Key InChIKey=BUIYABBYLZHTEJ-UHFFFAOYSA-N
Data  2 KI
  Tab Delimited (TSV)   2D SDfile   Computed 3D by Vconf -m prep SDfile
Find this compound or compounds like it in BindingDB:
Activity Spreadsheet -- Enzyme Inhibition Constant Data from BindingDB
Found 2 hits for monomerid = 403765
TargetMacrophage migration inhibitory factor(Homo sapiens (Human))
Yale University
US Patent
LigandPNGBDBM403765(US10336721, Example 23 | US10968198, Example 23)
Affinity DataKi:  2.96E+4nM. Assay description: Data obtained for the Example compounds, obtained using the methods described in Example B.
Ligand InfoPC cidPC sid
In DepthDetails US Patent
TargetMacrophage migration inhibitory factor(Homo sapiens (Human))
Yale University
US Patent
LigandPNGBDBM403765(US10336721, Example 23 | US10968198, Example 23)
Affinity DataKi:  2.96E+4nM. Assay description: Inhibition of the tautomerase activity of MIF was measured using 4-hydroxyphenyl pyruvic acid (HPP) as substrate, largely following previously report...
Ligand InfoPC cidPC sid
In DepthDetails US Patent