BDBM403779 US10336721, Example 38::US10968198, Example 38
SMILES Oc1ccc(cc1F)-n1cc(nn1)-c1ccc2c(Oc3cccc(OCCOCCN4CCOCC4)c3)cccc2n1
InChI Key InChIKey=AJEHQYXHAYASCZ-UHFFFAOYSA-N
Data  2 KI
  Tab Delimited (TSV)   2D SDfile   Computed 3D by Vconf -m prep SDfile
Find this compound or compounds like it in BindingDB:
Activity Spreadsheet -- Enzyme Inhibition Constant Data from BindingDB
Found 2 hits for monomerid = 403779
TargetMacrophage migration inhibitory factor(Homo sapiens (Human))
Yale University
US Patent
LigandPNGBDBM403779(US10336721, Example 38 | US10968198, Example 38)
Affinity DataKi:  128nM. Assay description: Data obtained for the Example compounds, obtained using the methods described in Example B.
Ligand InfoPC cidPC sid
In DepthDetails US Patent
TargetMacrophage migration inhibitory factor(Homo sapiens (Human))
Yale University
US Patent
LigandPNGBDBM403779(US10336721, Example 38 | US10968198, Example 38)
Affinity DataKi:  128nM. Assay description: Inhibition of the tautomerase activity of MIF was measured using 4-hydroxyphenyl pyruvic acid (HPP) as substrate, largely following previously report...
Ligand InfoPC cidPC sid
In DepthDetails US Patent