BDBM40378 3-(2,3-dihydro-1,4-benzodioxin-2-yl)-N-(2-furylmethyl)propanamide::3-(2,3-dihydro-1,4-benzodioxin-3-yl)-N-(2-furanylmethyl)propanamide::3-(2,3-dihydro-1,4-benzodioxin-3-yl)-N-(2-furfuryl)propionamide::3-(2,3-dihydro-1,4-benzodioxin-3-yl)-N-(furan-2-ylmethyl)propanamide::MLS000065376::SMR000079140::cid_2965121
SMILES O=C(CCC1COc2ccccc2O1)NCc1ccco1
InChI Key InChIKey=NBHYJZVCXZMVJU-UHFFFAOYSA-N
Data  1 IC50
  Tab Delimited (TSV)   2D SDfile   Computed 3D by Vconf -m prep SDfile
Find this compound or compounds like it in BindingDB:
Activity Spreadsheet -- Enzyme Inhibition Constant Data from BindingDB
Found 1 hit for monomerid = 40378
TargetCoagulation factor XII(Homo sapiens (Human))
Pcmd
Curated by PubChem BioAssay
LigandPNGBDBM40378(3-(2,3-dihydro-1,4-benzodioxin-2-yl)-N-(2-furylmet...)
Affinity DataIC50: >5.00E+4nM. Assay description: Molecular Library Screening Center Network (MLSCN) Penn Center for Molecular Discovery (PCMD) Assay Provider: Scott L. Diamond, University of Pennsy...
In DepthDetails PCBioAssay