BDBM403806 (2S,5R)-5-(2-chlorophenyl)-1-(3-methoxy-5-(2-methoxyethoxy)benzoyl)pyrrolidine-2-carboxylic acid::US10017468, Compound 31
SMILES OC(=O)[C@@H]1CC[C@@H](N1C(=O)c1ccc(cc1)-c1ccccc1)c1ccccc1
InChI Key InChIKey=HTOGGVGRNBJARX-YADHBBJMSA-N
Data  1 EC50
  Tab Delimited (TSV)   2D SDfile   Computed 3D by Vconf -m prep SDfile
Find this compound or compounds like it in BindingDB:
Activity Spreadsheet -- Enzyme Inhibition Constant Data from BindingDB
Found 1 hit for monomerid = 403806
TargetFree fatty acid receptor 2(Homo sapiens (Human))
Ogeda
US Patent
LigandPNGBDBM403806((2S,5R)-5-(2-chlorophenyl)-1-(3-methoxy-5-(2-metho...)
Affinity DataEC50: >1.00E+3nM. Assay description: The following assay can be used for determination of GPR43 activation. When a GPCR is in its active state, either as a result of ligand binding or co...
Ligand InfoPC cidPC sid
In DepthDetails US Patent