BDBM40399 2-(2,3-dihydro-1,4-benzodioxin-6-yloxy)acetic acid::2-(2,3-dihydro-1,4-benzodioxin-6-yloxy)ethanoic acid::MLS000113536::SMR000109434::cid_3132402
SMILES OC(=O)COc1ccc2OCCOc2c1
InChI Key InChIKey=HHBVMFFBGUGQMO-UHFFFAOYSA-N
Data  1 IC50
  Tab Delimited (TSV)   2D SDfile   Computed 3D by Vconf -m prep SDfile
Find this compound or compounds like it in BindingDB:
Activity Spreadsheet -- Enzyme Inhibition Constant Data from BindingDB
Found 1 hit for monomerid = 40399
TargetCoagulation factor XII(Homo sapiens (Human))
Pcmd
Curated by PubChem BioAssay
LigandPNGBDBM40399(2-(2,3-dihydro-1,4-benzodioxin-6-yloxy)acetic acid...)
Affinity DataIC50: >5.00E+4nM. Assay description: Molecular Library Screening Center Network (MLSCN) Penn Center for Molecular Discovery (PCMD) Assay Provider: Scott L. Diamond, University of Pennsy...
In DepthDetails PCBioAssay