BDBM40473 MLS000117129::N-(2,3-dihydro-1,4-benzodioxin-6-yl)-2-(2-methoxyethyl)-3-oxidanylidene-1H-isoindole-4-carboxamide::N-(2,3-dihydro-1,4-benzodioxin-6-yl)-2-(2-methoxyethyl)-3-oxo-1H-isoindole-4-carboxamide::N-(2,3-dihydro-1,4-benzodioxin-6-yl)-3-keto-2-(2-methoxyethyl)isoindoline-4-carboxamide::SMR000094082::cid_5307851
SMILES COCCN1Cc2cccc(C(=O)Nc3ccc4OCCOc4c3)c2C1=O
InChI Key InChIKey=HAVBXXSEEKCGAT-UHFFFAOYSA-N
Data  1 IC50  1 EC50
  Tab Delimited (TSV)   2D SDfile   Computed 3D by Vconf -m prep SDfile
Find this compound or compounds like it in BindingDB:
Activity Spreadsheet -- Enzyme Inhibition Constant Data from BindingDB
Found 2 hits for monomerid = 40473
TargetHeat shock factor protein 1(Mus musculus)
Broad Institute
Curated by PubChem BioAssay
LigandPNGBDBM40473(MLS000117129 | N-(2,3-dihydro-1,4-benzodioxin-6-yl...)
Affinity DataEC50:  1.16E+4nM. Assay description: Keywords: Heat Shock Factor-1 (HSF-1), Stress Response, MG132, NIH3T3, Luminescence Assay Overview: Modified NIH3T3, transformed to express firefly...
In DepthDetails PCBioAssay
TargetCollagenase 3(Homo sapiens (Human))
The Scripps Research Institute Molecular Screening Center
Curated by PubChem BioAssay
LigandPNGBDBM40473(MLS000117129 | N-(2,3-dihydro-1,4-benzodioxin-6-yl...)
Affinity DataIC50: >3.98E+4nM. Assay description: Source (MLSCN Center Name): The Scripps Research Institute Molecular Screening Center Center Affiliation: The Scripps Research Institute, TSRI Assay ...
In DepthDetails PCBioAssay