BDBM405091 1-{2-fluoro-4-[4-({[3- (trifluoromethoxy)phenyl]methyl} carbamoyl)-1H-1,2,3-triazol-1-yl] butyl}-N-{[6-(trifluoromethyl) pyridin-3-yl]methyl}-1H-1,2,3- triazole-4-carboxamide::US10344025, Example 435::US11370786, Example 435
SMILES FC(CCn1cc(nn1)C(=O)NCc1cccc(OC(F)(F)F)c1)Cn1cc(nn1)C(=O)NCc1ccc(nc1)C(F)(F)F
InChI Key InChIKey=AMQXSLXXEROQLF-UHFFFAOYSA-N
Data  2 IC50
  Tab Delimited (TSV)   2D SDfile   Computed 3D by Vconf -m prep SDfile
Find this compound or compounds like it in BindingDB:
Activity Spreadsheet -- Enzyme Inhibition Constant Data from BindingDB
Found 2 hits for monomerid = 405091
TargetGlutaminase kidney isoform, mitochondrial(Homo sapiens (Human))
Board Of Regents, The University Of Texas System
US Patent
LigandPNGBDBM405091(1-{2-fluoro-4-[4-({[3- (trifluoromethoxy)phenyl]me...)
Affinity DataIC50: <100nM. Assay description: The inhibition of purified recombinant human GAC by varying concentrations of inhibitors is assessed via a dual-coupled enzymatic assay. The glutamat...
Ligand InfoPC cidPC sid
In DepthDetails US Patent
TargetGlutaminase kidney isoform, mitochondrial(Homo sapiens (Human))
Board Of Regents, The University Of Texas System
US Patent
LigandPNGBDBM405091(1-{2-fluoro-4-[4-({[3- (trifluoromethoxy)phenyl]me...)
Affinity DataIC50: <100nM. Assay description: The inhibition of purified recombinant human GAC by varying concentrations of inhibitors is assessed via a dual-coupled enzymatic assay. The glutamat...
Ligand InfoPC cidPC sid
In DepthDetails US Patent