BDBM405267 1-(4-(7-(2,6-difluorobenzyl)-3-((dimethylamino)methyl)-5-(2-fluoro-3-methoxyphenyl)-4,6-dioxo-4,5,6,7-tetrahydro-2H-pyrazolo[3,4-d]pyrimidin-2-yl)phenyl)-3-ethylurea::US10344034, Example 3::US10633388, Example 3
SMILES CCNC(=O)Nc1ccc(cc1)-n1nc2n(Cc3c(F)cccc3F)c(=O)n(-c3cccc(OC)c3F)c(=O)c2c1CN(C)C
InChI Key InChIKey=DZBHQWJNFWYAKU-UHFFFAOYSA-N
Data  2 IC50
  Tab Delimited (TSV)   2D SDfile   Computed 3D by Vconf -m prep SDfile
Find this compound or compounds like it in BindingDB:
Activity Spreadsheet -- Enzyme Inhibition Constant Data from BindingDB
Found 2 hits for monomerid = 405267
TargetGonadotropin-releasing hormone receptor(Homo sapiens (Human))
Shanghai Hengrui Pharmaceutical
US Patent
LigandPNGBDBM405267(1-(4-(7-(2,6-difluorobenzyl)-3-((dimethylamino)met...)
Affinity DataIC50:  0.900nM. Assay description: In vitro GnRHr protein activity was tested by the following methods.This assay was used to determine the inhibition effect of the present compound on...
Ligand InfoPC cidPC sid
In DepthDetails US Patent
TargetGonadotropin-releasing hormone receptor(Homo sapiens (Human))
Shanghai Hengrui Pharmaceutical
US Patent
LigandPNGBDBM405267(1-(4-(7-(2,6-difluorobenzyl)-3-((dimethylamino)met...)
Affinity DataIC50:  0.900nM. Assay description: Human: Test Example 1. Human GnRHr (GnRH Receptor) Activity Assay of the Present Compounds.In vitro GnRHr protein activity was tested by the followin...
Ligand InfoPC cidPC sid
In DepthDetails US Patent