BDBM40528 2-phenyl-N-(2-pyridin-3-yl-1,3-benzoxazol-5-yl)acetamide::2-phenyl-N-(2-pyridin-3-yl-1,3-benzoxazol-5-yl)ethanamide::2-phenyl-N-[2-(3-pyridinyl)-1,3-benzoxazol-5-yl]acetamide::2-phenyl-N-[2-(3-pyridyl)-1,3-benzoxazol-5-yl]acetamide::MLS000061816::SMR000070293::cid_876095
SMILES O=C(Cc1ccccc1)Nc1ccc2oc(nc2c1)-c1cccnc1
InChI Key InChIKey=VXRNZZQITRRJGV-UHFFFAOYSA-N
Data  1 EC50
  Tab Delimited (TSV)   2D SDfile   Computed 3D by Vconf -m prep SDfile
Find this compound or compounds like it in BindingDB:
Activity Spreadsheet -- Enzyme Inhibition Constant Data from BindingDB
Found 1 hit for monomerid = 40528
TargetEstrogen receptor(Homo sapiens (Human))
Emory University
Curated by PubChem BioAssay
LigandPNGBDBM40528(2-phenyl-N-(2-pyridin-3-yl-1,3-benzoxazol-5-yl)ace...)
Affinity DataEC50:  2.12E+4nM. Assay description: NIH Molecular Libraries Screening Centers Network [MLSCN] Emory Chemical Biology Discovery Center in MLSCN Assay provider: John A. Katzenellenbogen, ...
In DepthDetails PCBioAssay