BDBM405454 USRE47493, Example 47A
SMILES CNC(=O)N1[C@@H](C2=C(CCCC2=O)N(C1=O)c1cccc(c1)C(F)(F)F)c1ccc(cc1S(C)(=O)=O)C#N
InChI Key InChIKey=QQWXVERXAIYPQE-JOCHJYFZSA-N
Data  1 IC50
  Tab Delimited (TSV)   2D SDfile   Computed 3D by Vconf -m prep SDfile
Find this compound or compounds like it in BindingDB:
Activity Spreadsheet -- Enzyme Inhibition Constant Data from BindingDB
Found 1 hit for monomerid = 405454
TargetNeutrophil elastase(Homo sapiens (Human))
Boehringer Ingelheim International
US Patent
LigandPNGBDBM405454(USRE47493, Example 47A)
Affinity DataIC50: <1nM. Assay description: Materials: Human neutrophil elastase was purchased from Calbiochem (Cat.No.: 324681) and the elastase substrate MeOSuc-Ala-Ala-Pro-Val-AMC from Bache...
Ligand InfoPC cidPC sid
In DepthDetails US Patent