BDBM405713 US10351547, Compound 2-180::US10597377, Compound 2-180
SMILES COC(=O)Nc1c(cc(F)c(F)c1-c1ccc2ncc(-c3cc(F)cc(F)c3)c(N3CCC(N)CC3)c2c1)C#N
InChI Key InChIKey=QHMFTGAHLYAZRJ-UHFFFAOYSA-N
Data  2 EC50
  Tab Delimited (TSV)   2D SDfile   Computed 3D by Vconf -m prep SDfile
Find this compound or compounds like it in BindingDB:
Activity Spreadsheet -- Enzyme Inhibition Constant Data from BindingDB
Found 2 hits for monomerid = 405713
TargetSomatostatin receptor type 2(Homo sapiens (Human))
Crinetics Pharmaceuticals
US Patent
LigandPNGBDBM405713(US10351547, Compound 2-180 | US10597377, Compound ...)
Affinity DataEC50: <10nM. Assay description: Four days prior to the assay, 5,000 Chinese hamster ovary cells (CHO-K1, ATCC # CCL-61) stably expressing the human SSTR2 are plated in each well of ...
Ligand InfoPC cidPC sid
In DepthDetails US Patent
TargetSomatostatin receptor type 2(Homo sapiens (Human))
Crinetics Pharmaceuticals
US Patent
LigandPNGBDBM405713(US10351547, Compound 2-180 | US10597377, Compound ...)
Affinity DataEC50: <10nM. Assay description: Four days prior to the assay, 5,000 Chinese hamster ovary cells (CHO-K1, ATCC #CCL-61) stably expressing the human SSTR2 are plated in each well of a...
Ligand InfoPC cidPC sid
In DepthDetails US Patent