BDBM40580 3,6-Di-furan-2-yl-[1,2,4]triazolo[3,4-b][1,3,4]thiadiazole::3,6-bis(2-furanyl)-[1,2,4]triazolo[3,4-b][1,3,4]thiadiazole::3,6-bis(2-furyl)-[1,2,4]triazolo[3,4-b][1,3,4]thiadiazole::3,6-bis(furan-2-yl)-[1,2,4]triazolo[3,4-b][1,3,4]thiadiazole::MLS000027782::SMR000015227::cid_655862
SMILES c1coc(c1)-c1nn2c(nnc2s1)-c1ccco1
InChI Key InChIKey=NTJAHJNZTGHMTR-UHFFFAOYSA-N
Data  3 IC50
  Tab Delimited (TSV)   2D SDfile   Computed 3D by Vconf -m prep SDfile
Find this compound or compounds like it in BindingDB:
Activity Spreadsheet -- Enzyme Inhibition Constant Data from BindingDB
Found 3 hits for monomerid = 40580
TargetNuclear receptor subfamily 4 group A member 1(Homo sapiens (Human))
Burnham Center For Chemical Genomics
Curated by PubChem BioAssay
LigandPNGBDBM40580(3,6-Di-furan-2-yl-[1,2,4]triazolo[3,4-b][1,3,4]thi...)
Affinity DataIC50:  8.65E+4nM. Assay description: Sanford-Burnham Center for Chemical Genomics (SBCCG) Sanford-Burnham Medical Research Institute (San Diego, CA) NIH Molecular Libraries Screening Cen...
In DepthDetails PCBioAssay
TargetNAD-dependent protein deacetylase sirtuin-1(Homo sapiens (Human))
Chinese Academy Of Sciences
Curated by ChEMBL
LigandPNGBDBM40580(3,6-Di-furan-2-yl-[1,2,4]triazolo[3,4-b][1,3,4]thi...)
Affinity DataIC50:  2.20E+4nM. Assay description: Inhibition of hexa-His-tagged recombinant human SIRT1 expressed in Escherichia coli BL21(DE3) using AMC-labeled Arg-His-Lys-Lys(ac) as substrate asse...
In DepthDetails ArticlePubMed
TargetEstrogen receptor beta(Homo sapiens (Human))
Emory University
Curated by PubChem BioAssay
LigandPNGBDBM40580(3,6-Di-furan-2-yl-[1,2,4]triazolo[3,4-b][1,3,4]thi...)
Affinity DataIC50:  2.40E+4nM. Assay description: NIH Molecular Libraries Screening Centers Network [MLSCN] Emory Chemical Biology Discovery Center in MLSCN Assay provider: John A. Katzenellenbogen, ...
In DepthDetails PCBioAssay