BDBM405826 US10351548, Compound DD22
SMILES Fc1ccc(Cn2cccc(C(=O)NCCC(=O)Nc3ccc4NC(=O)\C(=C/c5cccs5)c4c3)c2=O)cc1F
InChI Key InChIKey=PZGHXFYLEWZRGA-JCMHNJIXSA-N
Data  1 IC50
  Tab Delimited (TSV)   2D SDfile   Computed 3D by Vconf -m prep SDfile
Find this compound or compounds like it in BindingDB:
Activity Spreadsheet -- Enzyme Inhibition Constant Data from BindingDB
Found 1 hit for monomerid = 405826
Target3-phosphoinositide-dependent protein kinase 1(Homo sapiens (Human))
International Society For Drug Development
US Patent
LigandPNGBDBM405826(US10351548, Compound DD22)
Affinity DataIC50:  1.34E+3nM. Assay description: Factor IX is a key component of the plasma system that forms a fibrin clot at a site of vascular injury. The activity of Factor IXa is measured by mo...
Ligand InfoPC cidPC sid
In DepthDetails US Patent