BDBM405849 US10351558, Example 24
SMILES Cc1ccc(O)c2c3C[C@@](C)(CCc3nn12)NC(=O)c1ccc(cc1Cl)-n1cnc2cc(ccc12)C(O)=O
InChI Key InChIKey=BXAXQOSFVNHVDU-MUUNZHRXSA-N
Data  1 IC50
  Tab Delimited (TSV)   2D SDfile   Computed 3D by Vconf -m prep SDfile
Find this compound or compounds like it in BindingDB:
Activity Spreadsheet -- Enzyme Inhibition Constant Data from BindingDB
Found 1 hit for monomerid = 405849
TargetCoagulation factor IX(Homo sapiens (Human))
Merck Sharp & Dohme
US Patent
LigandPNGBDBM405849(US10351558, Example 24)
Affinity DataIC50:  2.78nM. Assay description: TBD
Ligand InfoPC cidPC sid
In DepthDetails US Patent