BDBM40594 2-[[5,6-bis(2-furanyl)-1,2,4-triazin-3-yl]thio]-N-(4-methylphenyl)acetamide::2-[[5,6-bis(2-furyl)-1,2,4-triazin-3-yl]thio]-N-(p-tolyl)acetamide::2-[[5,6-bis(furan-2-yl)-1,2,4-triazin-3-yl]sulfanyl]-N-(4-methylphenyl)acetamide::2-[[5,6-bis(furan-2-yl)-1,2,4-triazin-3-yl]sulfanyl]-N-(4-methylphenyl)ethanamide::MLS000077593::SMR000042109::cid_6400935
SMILES Cc1ccc(NC(=O)CSc2nnc(-c3ccco3)c(n2)-c2ccco2)cc1
InChI Key InChIKey=GYQNAWQXJLQUAF-UHFFFAOYSA-N
Data  5 IC50
  Tab Delimited (TSV)   2D SDfile   Computed 3D by Vconf -m prep SDfile
Find this compound or compounds like it in BindingDB:
Activity Spreadsheet -- Enzyme Inhibition Constant Data from BindingDB
Found 5 hits for monomerid = 40594
TargetNuclear receptor subfamily 4 group A member 1(Homo sapiens (Human))
Burnham Center For Chemical Genomics
Curated by PubChem BioAssay
LigandPNGBDBM40594(2-[[5,6-bis(2-furanyl)-1,2,4-triazin-3-yl]thio]-N-...)
Affinity DataIC50:  1.90E+4nM. Assay description: Sanford-Burnham Center for Chemical Genomics (SBCCG) Sanford-Burnham Medical Research Institute (San Diego, CA) NIH Molecular Libraries Screening Cen...
In DepthDetails PCBioAssay
TargetInduced myeloid leukemia cell differentiation protein Mcl-1(Homo sapiens (Human))
Emory University
Curated by PubChem BioAssay
LigandPNGBDBM40594(2-[[5,6-bis(2-furanyl)-1,2,4-triazin-3-yl]thio]-N-...)
Affinity DataIC50:  3.01E+3nM. Assay description: NIH Molecular Libraries Screening Centers Network [MLSCN] Emory Chemical Biology Discovery Center in MLSCN Assay provider: Nikolovska-Coleska, Univer...
In DepthDetails PCBioAssay
TargetPerilipin-5(Homo sapiens (Human))
The Scripps Research Institute Molecular Screening Center
Curated by PubChem BioAssay
LigandPNGBDBM40594(2-[[5,6-bis(2-furanyl)-1,2,4-triazin-3-yl]thio]-N-...)
Affinity DataIC50:  1.18E+3nM
In DepthDetails PCBioAssay
TargetPerilipin-1(Homo sapiens (Human))
The Scripps Research Institute Molecular Screening Center
Curated by PubChem BioAssay
LigandPNGBDBM40594(2-[[5,6-bis(2-furanyl)-1,2,4-triazin-3-yl]thio]-N-...)
Affinity DataIC50:  2.66E+3nM
In DepthDetails PCBioAssay
TargetHepatocyte nuclear factor 4-alpha(Homo sapiens (Human))
The Scripps Research Institute Molecular Screening Center
Curated by PubChem BioAssay
LigandPNGBDBM40594(2-[[5,6-bis(2-furanyl)-1,2,4-triazin-3-yl]thio]-N-...)
Affinity DataIC50:  1.60E+3nM
In DepthDetails PCBioAssay