BDBM40600 3-[3-(4-carbamoylpiperidino)propanoylamino]-4-methoxy-1H-indole-2-carboxylic acid methyl ester::3-[[3-(4-carbamoyl-1-piperidinyl)-1-oxopropyl]amino]-4-methoxy-1H-indole-2-carboxylic acid methyl ester::MLS000040533::SMR000045746::cid_664747::methyl 3-[3-(4-aminocarbonylpiperidin-1-yl)propanoylamino]-4-methoxy-1H-indole-2-carboxylate::methyl 3-[3-(4-carbamoylpiperidin-1-yl)propanoylamino]-4-methoxy-1H-indole-2-carboxylate
SMILES COC(=O)c1[nH]c2cccc(OC)c2c1NC(=O)CCN1CCC(CC1)C(N)=O
InChI Key InChIKey=QZIOMZYHPRNXOS-UHFFFAOYSA-N
Data  1 IC50
  Tab Delimited (TSV)   2D SDfile   Computed 3D by Vconf -m prep SDfile
Find this compound or compounds like it in BindingDB:
Activity Spreadsheet -- Enzyme Inhibition Constant Data from BindingDB
Found 1 hit for monomerid = 40600
TargetNuclear receptor subfamily 4 group A member 1(Homo sapiens (Human))
Burnham Center For Chemical Genomics
Curated by PubChem BioAssay
LigandPNGBDBM40600(3-[3-(4-carbamoylpiperidino)propanoylamino]-4-meth...)
Affinity DataIC50: >1.00E+5nM. Assay description: Sanford-Burnham Center for Chemical Genomics (SBCCG) Sanford-Burnham Medical Research Institute (San Diego, CA) NIH Molecular Libraries Screening Cen...
In DepthDetails PCBioAssay