BDBM40609 7-[[4-(2,4-dimethylphenyl)-5-pyridin-3-yl-1,2,4-triazol-3-yl]sulfanylmethyl]-[1,3]thiazolo[3,2-a]pyrimidin-5-one::7-[[[4-(2,4-dimethylphenyl)-5-(3-pyridinyl)-1,2,4-triazol-3-yl]thio]methyl]-5-thiazolo[3,2-a]pyrimidinone::7-[[[4-(2,4-dimethylphenyl)-5-(3-pyridyl)-1,2,4-triazol-3-yl]thio]methyl]thiazolo[3,2-a]pyrimidin-5-one::MLS000058257::SMR000065026::cid_2549560
SMILES Cc1ccc(c(C)c1)-n1c(SCc2cc(=O)n3ccsc3n2)nnc1-c1cccnc1
InChI Key InChIKey=CCUGLDMUHTVGOJ-UHFFFAOYSA-N
Data  4 IC50
  Tab Delimited (TSV)   2D SDfile   Computed 3D by Vconf -m prep SDfile
Find this compound or compounds like it in BindingDB:
Activity Spreadsheet -- Enzyme Inhibition Constant Data from BindingDB
Found 4 hits for monomerid = 40609
TargetNuclear receptor subfamily 4 group A member 1(Homo sapiens (Human))
Burnham Center For Chemical Genomics
Curated by PubChem BioAssay
LigandPNGBDBM40609(7-[[4-(2,4-dimethylphenyl)-5-pyridin-3-yl-1,2,4-tr...)
Affinity DataIC50: >1.00E+5nM. Assay description: Sanford-Burnham Center for Chemical Genomics (SBCCG) Sanford-Burnham Medical Research Institute (San Diego, CA) NIH Molecular Libraries Screening Cen...
In DepthDetails PCBioAssay
TargetTyrosine-protein kinase ABL1(Homo sapiens (Human))
The Scripps Research Institute Molecular Screening Center
Curated by PubChem BioAssay
LigandPNGBDBM40609(7-[[4-(2,4-dimethylphenyl)-5-pyridin-3-yl-1,2,4-tr...)
Affinity DataIC50:  1.96E+4nM. Assay description: Source (MLPCN Center Name): The Scripps Research Institute Molecular Screening Center (SRIMSC) Affiliation: The Scripps Research Institute, TSRI Assa...
In DepthDetails PCBioAssay
TargetEstrogen receptor beta(Homo sapiens (Human))
Emory University
Curated by PubChem BioAssay
LigandPNGBDBM40609(7-[[4-(2,4-dimethylphenyl)-5-pyridin-3-yl-1,2,4-tr...)
Affinity DataIC50:  5.00E+4nM. Assay description: NIH Molecular Libraries Screening Centers Network [MLSCN] Emory Chemical Biology Discovery Center in MLSCN Assay provider: John A. Katzenellenbogen, ...
In DepthDetails PCBioAssay
TargetEstrogen receptor beta(Homo sapiens (Human))
Emory University
Curated by PubChem BioAssay
LigandPNGBDBM40609(7-[[4-(2,4-dimethylphenyl)-5-pyridin-3-yl-1,2,4-tr...)
Affinity DataIC50:  721nM. Assay description: NIH Molecular Libraries Screening Centers Network [MLSCN] Emory Chemical Biology Discovery Center in MLSCN Assay provider: John A. Katzenellenbogen, ...
In DepthDetails PCBioAssay