BDBM406230 5-(((3,4-dichlorophenyl) thio) methyl)-2-oxo-1,2-dihydropyridin-3-yl 4-phenethyl-1H-pyrrole-2-carboxylate::US10336724, Compound 50
SMILES Clc1ccc(SCc2c[nH]c(=O)c(OC(=O)c3cc(CCc4ccccc4)c[nH]3)c2)cc1Cl
InChI Key InChIKey=ICLVBKCIUNOCPT-UHFFFAOYSA-N
Data  2 IC50
  Tab Delimited (TSV)   2D SDfile   Computed 3D by Vconf -m prep SDfile
Find this compound or compounds like it in BindingDB:
Activity Spreadsheet -- Enzyme Inhibition Constant Data from BindingDB
Found 2 hits for monomerid = 406230
TargetD-amino-acid oxidase(Sus scrofa (pig))
SyneuRx International (Taiwan)
US Patent
LigandPNGBDBM406230(5-(((3,4-dichlorophenyl) thio) methyl)-2-oxo-1,2-d...)
Affinity DataIC50:  5.50E+3nM. Assay description: The pkDAAO (porcine kidney DAAO) activity was measured by using D-Proine as a substrate to produce hydrogen peroxide (H2O2). The produced H2O2 would ...
Ligand InfoPC cidPC sid
In DepthDetails US Patent
TargetD-amino-acid oxidase(Homo sapiens (Human))
SyneuRx International (Taiwan)
US Patent
LigandPNGBDBM406230(5-(((3,4-dichlorophenyl) thio) methyl)-2-oxo-1,2-d...)
Affinity DataIC50:  5.50E+3nM. Assay description: The hDAAO (human DAAO) activity was measured by using D-serine as a substrate to produce H2O2. The produced H2O2 would be oxidized by peroxidase, and...
Ligand InfoPC cidPC sid
In DepthDetails US Patent